Error Expected Type-specifier Before Ad_cast

RECOMMENDED: If you have Windows errors then we strongly recommend that you download and run this (Windows) Repair Tool.

Aug 12, 2012. The RInside package comes with working examples for MPI: [email protected]:~$ ls -l / usr/local/lib/R/site-library/RInside/examples/mpi/ total 24.

Mar 28, 2016. With new you are allocating memory on the heap, and so you need a pointer to point to that newly allocated memory: MyObj<int>* s1 = new.

Nov 12, 2012. Auto boot broadcast application.. Interaction with broadcast-triggered native applications.. Limitations on standard data-types.. not found to be publicly available in the expected location might be found at. NOTE: Where a Stream object uses an explicit reference before a. ICNetwork Error.

in compiling c++ console my program, i get an error in the included vector header file, > error: expected type-specifier before 'static_cast' > c:.

"expected nested-name-specifier before 'const' error" with typename. Getting a "expected type-specifier" error when I instantiate a custom class in a.

Error 35 Itunes Download To listen to the show, click play below or use this link to download. To follow Hofstetter on Twitter. click here or search SNY Mets on Apple Podcasts, Error -3198 – Error downloading and retry. Error -50 – QuickTime issue, iTunes and storm video need to be reinstalled. Error -35 – Downloading Songs that were

Specifier – In below code while compiling i am getting error , Error : main.cpp:8:57: error: expected type-specifier before ‘Staircase’ std::unique_ptr algodiagnostic (new Staircase()); compilation command g++ HardwareDiagnostic.cpp.

error: expected a type specifier. You could check this by adding this block just before line 11313:. I used the error number(#80 for 'expected a type specifier

But before i start implementing my. this declaration has no storage class or type specifier "c:/ti/ccsv6/tools/compiler/ti-cgt-msp430_4.4.1/include/intrinsics.h", line 28: error #66: expected a ";" "c:/ti/ccsv6/tools/compiler/ti-cgt.

. Why am I getting the error "expected type-specifier" when using declval as a template argument?. error: expected type-specifier prog.cpp.

Type specifiers determine the type of the name being declared. The following are type specifiers:

error: expected type-specifier before ‘cSchedulesLock’ lock = new cSchedulesLock(); ^~~~~~ thread.c:103:21: error: ‘Schedules’ is not a member of ‘cSchedules’ if (cSchedules::Schedules(*lock)->GetSchedule(channel)) { ^~~~~~.

Ora-06650 Error I am getting an error when executing the following, and I want to display an error message instead of an error: declare bday date not null := '13-sep-78'; begin. ORA-06550 Oracle Database Tips by Donald Burleson. The ORA-06550 error is a generic PL/SQL compile error: ORA-06550: line string, column Learn the cause and how to

RECOMMENDED: Click here to fix Windows errors and improve system performance